{"text_format":"1","workbook":"xlsx","n_sheets":11,"sheets":["Formulaire","Listes déroulantes","Explication","Minutes=Centième","Codes","Choix","Calendriers","Composantes","Dates","Heures","Personnel"],"not_rendered":{"charts":0,"images":2,"macros":1,"external_links":0,"defined_names":33,"comments":0,"pivot_tables":0},"unopened":[],"bounds":{"document_bytes":16777216,"sheet_cells":100000,"rows_first":2000,"rows_last":500,"rows_between":2000,"halvings":0,"cell_chars":16384,"cell_head_chars":4096},"cells_cut":0,"cells_raw":0,"read":"whole","date_system":"1900"}

{"sheet":"Formulaire","index":0,"n_rows":73,"n_cols":34,"rows_kept":73,"cut":false,"hidden":false,"merged":[[49,12,49,23],[51,15,51,21],[56,15,56,21],[54,8,54,10],[52,2,52,3],[49,5,49,10],[49,2,49,4],[51,2,51,4],[54,2,54,4],[13,18,13,21],[38,11,38,12],[41,11,41,12],[40,11,40,12],[39,11,39,12],[59,22,59,23],[46,2,46,23],[34,11,34,12],[22,2,22,23],[24,11,24,12],[37,11,37,12],[29,11,29,12],[30,11,30,12],[31,11,31,12],[32,11,32,12],[33,11,33,12],[54,17,54,18],[54,15,54,16],[44,2,45,23],[56,2,57,9],[57,22,57,23],[4,6,6,23],[36,11,36,12],[20,8,20,12],[23,11,23,23],[25,2,25,9],[25,11,25,23],[35,11,35,12],[26,11,26,12],[28,11,28,12],[27,11,27,12],[20,3,20,6],[11,2,11,23],[17,2,17,23],[13,3,13,8],[13,14,13,16],[13,11,13,13]]}
[null,null,null,null,null,null,null,null,null,null,null,null,null,null,null,null,null,null,null,null,null,null,null,null,null,null,null,null,null,null,null,null,null,{"$f":"LEN(W14)","v":0}]
[null,null,null,null,null,null,null,null,null,null,null,null,null,null,null,null,null,null,null,null,null,null,null,null,null,null,null,null,null,null,null,null,null,{"$f":"IF(O10=\"CENTRE\",IF(AH1=1,CONCATENATE(\"00000\",W14),IF(AH1=2,CONCATENATE(\"0000\",W14),IF(AH1=3,CONCATENATE(\"000\",W14),IF(AH1=4,CONCATENATE(\"00\",W14),IF(AH1=5,CONCATENATE(\"0\",W14),W14))))),W14)","v":0}]
[1]
[]
[null,null,null,null,null,null,"AVIS DE MODIFICATION À LA FEUILLE DE TEMPS OU RELEVÉ DE PRÉSENCE"]
[]
[]
[]
[]
[null,null,null,null,null,null,null,null,null,null,null,"NOM DU CISSS :",null,null,null,null,null,null,null,null,null,null,null,null,null,null,{"$f":"CONCATENATE(CISSS,\"\\FT\\Avis de modification\\ARCHIVÉ\\\",Année,\"\\P0\",Période,\"\\\",\" \",Matricule, \" \", Prénom, \" \", Nom,\"  \",AC25)","v":{"$error":"#N/A"}}]
[]
[null,null,"IDENTIFICATION DE L’EMPLOYÉ"]
[]
[null,null,"Nom:",null,null,null,null,null,null,null,null,"Prénom:",null,null,null,null,null,null,"Matricule:",null,null,null,null,null,null,null,{"$f":"LEFT(AA18,4)","v":"2021"},{"$f":"LEFT(AB18,4)","v":"0"}]
[null,null,null,null,null,null,null,null,null,null,null,null,null,null,null,null,null,null,null,null,null,null,null,null,null,null,{"$f":"VALUE(RIGHT(AA18,2))","v":10},{"$f":"VALUE(RIGHT(AB18,2))","v":0},null,{"$error":"#VALUE!"}]
[null,null,null,null,null,null,null,null,null,null,null,null,null,null,null,null,null,null,null,null,null,null,null,null,null,null,4]
[null,null,null,null,null,null,null,null,null,null,null,null,null,null,null,null,null,null,null,null,null,null,null,null,null,null,5]
[null,null,"IDENTIFICATION DE LA PÉRIODE À CORRIGER",null,null,null,null,null,null,null,null,null,null,null,null,null,null,null,null,null,null,null,null,null,null,null,"2021 - 10",{"$f":"P55","v":0}]
[null,null,null,null,null,null,null,null,null,null,null,null,null,null,null,null,null,null,null,null,null,null,null,null,null,null,{"$f":"CONCATENATE(CISSS,\"\\FT\\Avis de modification\\À TRAITER\\\",Matricule, \" \", Prénom, \" \", Nom,\"  \",\"AVIS \",Temps )","v":{"$error":"#N/A"}}]
[null,null,null,null,null,null,null,null,null,null,null,null,null,null,null,null,null,null,null,null,null,null,null,null,null,null,"CISSSMC\\FT\\Avis de modification\\À TRAITER\\000012 TEST Daniel  AVIS2021-04-15 12 01 25",null,{"$f":"AA27","v":"999999  TEST Daniel  2019-11-26 11 55 18.xlsm"}]
{"$rows_left_out":54}
{"sheet":"Listes déroulantes","index":1,"n_rows":59,"n_cols":11,"rows_kept":59,"cut":false,"hidden":true,"merged":[]}
["Liste des motifs","Liste des statuts","Liste des établissements","Identification d'heures à payer","Multiplicateur",null,"BM","Multiplicateur",null,"Primes","Multiplicateur"]
["Veuillez sélectionner dans la liste","Sélectionner","Veuillez sélectionner dans la liste","Absence autorisée non payée",null,null,"Sélectionner",0,null,"Ancienneté"]
["Augmentation statutaire","1- Temps complet","Centre de réadaptation en dépendance Le Virage","Absence non-autorisée",null,null,"BM maladie (+ 3 mois)",4.2099999999999999E-2,null,"Assistant chef-d'équipe"]
["Avancement accéléré d'échelon - rendement exceptionnel (Prof.)","2- Temps complet temporaire","Centre jeunesse de la Montérégie","Affect.trav.enceinte",null,null,"BM férié",5.7000000000000002E-2,null,"Autre (Préciser)"]
["Avancement d'échelon au 6 mois - pour les 8ers échelons - Prof.)","3- Temps partiel","Centre montérégien de réadaptation","Assignation temporaire",null,null,"BM maladie (- 3mois)",6.2100000000000002E-2,null,"Chef d'équipe"]
["CADRE - Cumul de fonction","4- Temps partiel temporaire","CRDITED de la Montérégie-Est","Assurance-salaire non-payée",null,null,"Psychiatrie %",0.02,null,"Coordination professionnelle"]
["CADRE - Hausse de classe salariale","5- Occassionel","CSSS Champlain-Charles-Le Moyne","Assurance-salaire payée",null,null,"Vacances (TP +25 ans)",0.11210000000000001,null,"Disponibilité (Garde)"]
["CADRE - Intérim à un poste",null,"CSSS de Vaudreuil-Soulanges","Congé de nuit",null,null,"Vacances (TP moins 17 ans)",8.77E-2,null,"Fin de semaine"]
["CÉPI - Obtention du permis d'exercice",null,"CSSS du Haut-Saint-Laurent","Congé décès",null,null,"Vacances (TP 17-18 ans)",9.2499999999999999E-2,null,"Heures brisées"]
["Changement de titre d'emploi",null,"CSSS du Suroît","Congé Familial non-payé",null,null,"Vacances (TP 19-20 ans)",9.7299999999999998E-2,null,"Initiation/formation inf."]
["Erreur de codification autre",null,"CSSS Haut-Richelieu-Rouville","Congé familial payé",null,null,"Vacances (TP 21-22 ans)",0.1022,null,"Linge souillé"]
["Examen de l'ordre réussi",null,"CSSS Jardins-Roussillon","Congé mariage payé",null,null,"Vacances (TP 23-24 ans)",0.1071,null,"Nuit"]
["Expérience antérieure à l'embauche",null,"CSSS Pierre-Boucher","Congé mariage sans solde",null,null,null,null,null,"Psychiatrique"]
["Expérience en cours d'emploi acquise autre employeur",null,"CSSS Pierre-De-Saurel","Congé partiel",null,null,null,null,null,"Soins critiques"]
["Formation postscolaire / Scolarité / Rémunération additionnelle",null,"CSSS Richelieu-Yamaska","Congé maternité",null,null,null,null,null,"Soins intensifs"]
["Mutation - Promotion",null,"Institut Nazareth et Louis-Braille","Congé paternité (3-5 sem.)",null,null,null,null,null,"Soir"]
["Mutation - Rétrogradation",null,"Pavillon Foster","Congé paternité (5 jours)"]
["Mutation - Transfert",null,"Services de réadaptation du Sud-ouest et du Renfort","Congé pour études"]
["Reclassification",null,null,"Congé psychiatrique"]
["AUTRE - Voir commentaire",null,null,"Congé retraite progressive"]
{"$rows_left_out":40}
{"sheet":"Explication","index":2,"n_rows":73,"n_cols":28,"rows_kept":73,"cut":false,"hidden":false,"merged":[[24,11,24,12],[4,9,6,22],[9,2,9,5],[9,6,9,8],[11,2,11,22],[13,3,13,8],[13,11,13,13],[13,14,13,16],[13,18,13,20],[17,2,17,22],[20,2,20,5],[20,8,20,12],[22,2,22,22],[23,11,23,22],[35,11,35,12],[25,2,25,9],[25,11,25,22],[26,11,26,12],[27,11,27,12],[28,11,28,12],[29,11,29,12],[30,11,30,12],[31,11,31,12],[32,11,32,12],[33,11,33,12],[34,11,34,12],[51,2,51,4],[51,15,51,20],[36,11,36,12],[37,11,37,12],[38,11,38,12],[39,11,39,12],[40,11,40,12],[41,11,41,12],[44,2,45,22],[46,2,46,22],[49,2,49,4],[49,5,49,10],[49,12,49,22],[57,21,57,22],[59,21,59,22],[52,2,52,3],[54,2,54,4],[54,8,54,10],[54,15,54,16],[54,17,54,18],[56,2,57,9],[56,15,56,20]]}
[]
[]
[1]
[]
[null,null,null,null,null,null,null,null,null,"AVIS DE MODIFICATION À LA FEUILLE DE TEMPS OU RELEVÉ DE PRÉSENCE"]
[]
[]
[]
[]
[null,null,"NOM DU CISSS :",null,null,null,null,null,null,null,null,null,null,null,null,null,null,null,null,null,null,null,null,null,null,{"$f":"CONCATENATE(CISSS,\"\\FT\\Avis de modification\\ARCHIVÉ\\\",Année,\"\\P0\",Période,\"\\\",\" \",Matricule, \" \", Prénom, \" \", Nom,\"  \",AC25)","v":{"$error":"#N/A"}}]
[null,null,null,null,null,null,null,null,null,null,null,null,null,null,null,null,null,null,null,null,null,null,null,null,null,"CISSSMC\\FT\\Avis de modification\\ARCHIVÉ\\2019\\P04\\ 999999 Daniel TEST  43733,5506386574"]
[null,null,"IDENTIFICATION DE L’EMPLOYÉ"]
[]
[null,null,"Nom:",null,null,null,null,null,null,null,null,"Prénom:",null,null,null,null,null,null,"No employé:",null,null,null,null,null,null,{"$f":"LEFT(Z18,4)","v":"2019"}]
[null,null,null,null,null,null,null,null,null,null,null,null,null,null,null,null,null,null,null,null,null,null,null,null,null,{"$f":"VALUE(RIGHT(Z18,2))","v":24}]
[null,null,null,null,null,null,null,null,null,null,null,null,null,null,null,null,null,null,null,null,null,null,null,null,null,4]
[null,null,null,null,null,null,null,null,null,null,null,null,null,null,null,null,null,null,null,null,null,null,null,null,null,5]
[null,null,"IDENTIFICATION DE LA PÉRIODE À CORRIGER",null,null,null,null,null,null,null,null,null,null,null,null,null,null,null,null,null,null,null,null,null,null,"2019 - 24"]
[null,null,null,null,null,null,null,null,null,null,null,null,null,null,null,null,null,null,null,null,null,null,null,null,null,{"$f":"CONCATENATE(CISSS,\"\\FT\\Avis de modification\\À TRAITER\\\",Matricule, \"  \", Prénom, \" \", Nom,\"  \",Temps )","v":{"$error":"#N/A"}}]
[null,null,null,null,null,null,null,null,null,null,null,null,null,null,null,null,null,null,null,null,null,null,null,null,null,"CISSSMC\\FT\\Avis de modification\\À TRAITER\\999999  TEST Daniel  2019-11-26 11 55 18",null,{"$f":"Z27","v":"999999  TEST Daniel  2019-11-26 11 55 18.xlsm"}]
{"$rows_left_out":54}
{"sheet":"Minutes=Centième","index":3,"n_rows":31,"n_cols":4,"rows_kept":31,"cut":false,"hidden":false,"merged":[]}
["Minutes","Centième","Minutes","Centième"]
[1,{"$f":"A2/60","v":1.6666666666666666E-2},31,{"$f":"C2/60","v":0.51666666666666672}]
[2,{"$f":"A3/60","v":3.3333333333333333E-2},32,{"$f":"C3/60","v":0.53333333333333333}]
[3,0.05,33,0.55000000000000004]
[4,6.6666666666666666E-2,34,0.56666666666666665]
[5,8.3333333333333329E-2,35,0.58333333333333337]
[6,0.1,36,0.6]
[7,0.11666666666666667,37,0.6166666666666667]
[8,0.13333333333333333,38,0.6333333333333333]
[9,0.15,39,0.65]
[10,0.16666666666666666,40,0.66666666666666663]
[11,0.18333333333333332,41,0.68333333333333335]
[12,0.2,42,0.7]
[13,0.21666666666666667,43,0.71666666666666667]
[14,0.23333333333333334,44,0.73333333333333328]
[15,0.25,45,0.75]
[16,0.26666666666666666,46,0.76666666666666672]
[17,0.28333333333333333,47,0.78333333333333333]
[18,0.3,48,0.8]
[19,0.31666666666666665,49,0.81666666666666665]
{"$rows_left_out":12}
{"sheet":"Codes","index":4,"n_rows":257,"n_cols":12,"rows_kept":257,"cut":false,"hidden":true,"merged":[[0,0,1,5],[0,6,1,11]]}
["Codes horaires",null,null,null,null,null,"Codes de primes"]
[]
["CENTRE",null,"EST",null,"OUEST",null,"CENTRE",null,"EST",null,"OUEST"]
["Codes","description","Codes","description","Codes","description","Codes","description","Codes","description","Codes","description"]
["6/8","Horaire 6/8","*MOB","QT MOBILE SECT-COMPO","1½MAJ","SUPP MAJ 1½","52102","Allocation DASP medecin spéc.",151,"Tec.eeg charg.ens.cl",3,"Cumul de postes"]
["7/7","Horaire 7 / 7","*RATT","CA RATTACHEMENT","AAM","ABSENCE À MOTIVER","55702","Projet envergure",174,"Prime de sortie",5,"$3000 valoris.(inf.)"]
["AACN","Absence autorisée sur congé de nuit","*STAB","STABILITE CEPI CEPIA","AANP","ABS AUTORISÉE NP","56502","Forfaitaire sage-femme",185,"Prime chef d'equipe",6,"Responsabilite 8%"]
["AANP","Absence autorisée non payé","*SURP","SURPLUS NON PLACÉ","AANR","Absence autorisée NR","56702","Directeur santé publique Montérégie",190,"Ass chef equipe",7,"$8000 valor.(35 ans)"]
["AANPy","Absence autorisée non payé (liste rappel)","AA","ABS AUTO SANS SOLDE","ACREG","Régulier accompagnateur","al d(a)sp","Allocation établissement DSP-DASP (2%)",210,"Supervision/Responsabilité",10,"Prime 7.5%"]
["ABS","Absence","AANR","AAPERSO SURP.NON REQ","ACTS","Accomp TS x 1½","Al dsp ms","Allocation DSP medecin spéc.",220,"Cumul postes",15,"Prime -retraite"]
["AC","Accueil RH- orientation","AARH","ABSENCE AUTORISÉE RH","ADOP5","ADOPTION 5 JOURS","Al dspu ms","Allocation DSPU medecin spéc.",225,"Interim cadre",35,"Interim-chef serv."]
["AD","Adoption (58)","ABSEN","ABSENCE","ADOPT","CONGÉ ADOPTION 5 SEM","AL EXC MD","Allocation CAD-MED exclusif",321,"Supervision de stage",41,"Coord. clinique"]
["ADS","Adoption sans solde (59)","ABSRH","ABSENCE RH","ADOSS","CG adoption 10 sem.","ANC","Prime d'ancienneté",421,"Majorée Nuit 0-5 ans",50,"Comp.horaire 4 j"]
["ADT14","14 premiers jours d'absences CNESST","ACC1½","ACCOMPA CLIENT TSX1½","AFCIV","ab fonction civique","APP.RÉUS","Prime cours d'approche réussi",422,"Majorée Nuit 5-10 ans",51,"Post-scolaire bs"]
["ANA","Absences non autorisé","ACCLI","ACCUEIL CLINIQUE","AFECN","Affect.trav.enceinte","Att biochi","Attraction des biochimistes",423,"Majorée Nuit 10 ans+",72,"Remun. additionnelle"]
["AS","Assurance Salaire (10)","ACCOM","ACCOMPAGN. CLIENTELE","AFEPA","Employé retiré pour pandémie réaffecté","ATT O.SP","Prime d'attraction/rétention pour ouvriers spécialisés",450,"Prime fin de semaine",74,"Cumul poste cadre 9%"]
["AS +2","Assurance salaire + de 2 ans (10)","ACCX1","ACCOMPA. CLIENT TSX1","AFFEX","Affectation externe","ATT PHA","Prime d'attraction et rétention des pharmaciens",458,"Prime de soir %",75,"Cumul poste cadre 6%"]
["AS-15","Assurance salaire - entre 6 et 14 jours (10)","ACCX2","ACCOMPA. CLIENT TSX2","AM3AN","maladie 3e année","ATT TGB","Prime temporaire attribution / rétention (TGB)",462,"Majorée soir",76,"Cumul poste cadre 5%"]
["ASNP","Assurance salaire non payé","ACGEN","ACCUEIL GENERAL","ANA","Abs.non autorisée","ATT THT","Prime temporaire attribution / rétention (THT)",465,"Nuit 0-5 ans",77,"Cumul poste cadre10%"]
["ASST","Assignation temporaire (non travaillé)","ADOP5","ADOPTION 5 JRS","APPCO","hres rappel conv.","ATTCHSLD","Prime d'attraction CHSLD",466,"Nuit 5-10  ans",78,"Cumul poste cadre15%"]
{"$rows_left_out":238}
{"sheet":"Choix","index":5,"n_rows":3,"n_cols":1,"rows_kept":3,"cut":false,"hidden":true,"merged":[]}
["CORRECTION"]
["AJOUT"]
["ANNULATION"]

{"sheet":"Calendriers","index":6,"n_rows":263,"n_cols":7,"rows_kept":263,"cut":false,"hidden":true,"merged":[[0,0,0,2]]}
["Logibec",null,null,null,"Médisolution"]
["Date de fin","Période","Paiement",null,"Période","Date de fin","Paiement"]
["2015-04-04",201601,null,null,201501,"2014-12-27"]
[{"$f":"A3+14","v":"2015-04-18"},201602,null,null,201502,{"$f":"F3+14","v":"2015-01-10"}]
[{"$f":"A4+14","v":"2015-05-02"},201603,null,null,201503,{"$f":"F4+14","v":"2015-01-24"}]
["2015-05-16",201604,null,null,201504,"2015-02-07"]
["2015-05-30",201605,null,null,201505,"2015-02-21"]
["2015-06-13",201606,null,null,201506,"2015-03-07"]
["2015-06-27",201607,null,null,201507,"2015-03-21"]
["2015-07-11",201608,null,null,201508,"2015-04-04"]
["2015-07-25",201609,null,null,201509,"2015-04-18"]
["2015-08-08",201610,null,null,201510,"2015-05-02"]
["2015-08-22",201611,null,null,201511,"2015-05-16"]
["2015-09-05",201612,null,null,201512,"2015-05-30"]
["2015-09-19",201613,null,null,201513,"2015-06-13"]
["2015-10-03",201614,null,null,201514,"2015-06-27"]
["2015-10-17",201615,null,null,201515,"2015-07-11"]
["2015-10-31",201616,null,null,201516,"2015-07-25"]
["2015-11-14",201617,null,null,201517,"2015-08-08"]
["2015-11-28",201618,null,null,201518,"2015-08-22"]
{"$rows_left_out":244}
{"sheet":"Composantes","index":7,"n_rows":4,"n_cols":5,"rows_kept":4,"cut":false,"hidden":true,"merged":[]}
[null,null,"Système",{"$f":"VLOOKUP(Formulaire!O10,B2:C17,2,FALSE)","v":{"$error":"#N/A"}},{"$f":"VLOOKUP(Formulaire!O10,B2:D17,3,FALSE)","v":{"$error":"#N/A"}}]
[1,"CENTRE","Médisolution","CISSSMC"]
[2,"EST","Logibec","CISSSME"]
[3,"OUEST","Logibec","CISSSMO"]

{"sheet":"Dates","index":8,"n_rows":302,"n_cols":1,"rows_kept":302,"cut":false,"hidden":true,"merged":[]}
[{"$f":"Formulaire!I21","v":"00:00:00"}]
[{"$f":"IF((B1)<=Formulaire!$O$21,(A1+1),0)","v":"1900-01-01"}]
[{"$f":"IF((B2)<=Formulaire!$O$21,(A2+1),0)","v":"1900-01-02"}]
[{"$f":"IF((B3)<=Formulaire!$O$21,(A3+1),0)","v":"1900-01-03"}]
[{"$f":"IF((B4)<=Formulaire!$O$21,(A4+1),0)","v":"1900-01-04"}]
[{"$f":"IF((B5)<=Formulaire!$O$21,(A5+1),0)","v":"1900-01-05"}]
[{"$f":"IF((B6)<=Formulaire!$O$21,(A6+1),0)","v":"1900-01-06"}]
[{"$f":"IF((B7)<=Formulaire!$O$21,(A7+1),0)","v":"1900-01-07"}]
[{"$f":"IF((B8)<=Formulaire!$O$21,(A8+1),0)","v":"1900-01-08"}]
[{"$f":"IF((B9)<=Formulaire!$O$21,(A9+1),0)","v":"1900-01-09"}]
[{"$f":"IF((B10)<=Formulaire!$O$21,(A10+1),0)","v":"1900-01-10"}]
[{"$f":"IF((B11)<=Formulaire!$O$21,(A11+1),0)","v":"1900-01-11"}]
[{"$f":"IF((B12)<=Formulaire!$O$21,(A12+1),0)","v":"1900-01-12"}]
[{"$f":"IF((B13)<=Formulaire!$O$21,(A13+1),0)","v":"1900-01-13"}]
[{"$f":"IF((B14)<=Formulaire!$O$21,(A14+1),0)","v":"1900-01-14"}]
[{"$f":"IF((B15)<=Formulaire!$O$21,(A15+1),0)","v":"1900-01-15"}]
[{"$f":"IF((B16)<=Formulaire!$O$21,(A16+1),0)","v":"1900-01-16"}]
[{"$f":"IF((B17)<=Formulaire!$O$21,(A17+1),0)","v":"1900-01-17"}]
[{"$f":"IF((B18)<=Formulaire!$O$21,(A18+1),0)","v":"1900-01-18"}]
[{"$f":"IF((B19)<=Formulaire!$O$21,(A19+1),0)","v":"1900-01-19"}]
{"$rows_left_out":283}
{"sheet":"Heures","index":9,"n_rows":98,"n_cols":2,"rows_kept":98,"cut":false,"hidden":true,"merged":[]}
["Heures","Repas"]
["0:00","0:15"]
["0:15","0:30"]
["0:30","0:45"]
["0:45","1:00"]
["1:00"]
["1:15"]
["1:30"]
["1.45"]
["2:00"]
["2:15"]
["2:30"]
["2:45"]
["3:00"]
["3:15"]
["3:30"]
["3:45"]
["4:00"]
["4:15"]
["4:30"]
{"$rows_left_out":79}
{"sheet":"Personnel","index":10,"n_rows":95,"n_cols":6,"rows_kept":95,"cut":false,"hidden":true,"merged":[]}
["Alexandra, Black",null,null,"Nom","Prénom","Complet"]
["Amélie, Delage",null,null,"Black","Alexandra",{"$f":"CONCATENATE(E2,\", \",D2)","v":"Alexandra, Black"}]
["André, Bernard ",null,null,"Delage","Amélie","Amélie, Delage"]
["Anne-Marie, Faille",null,null,"Bernard ","André","André, Bernard "]
["Annie, Bureau",null,null,"Faille","Anne-Marie","Anne-Marie, Faille"]
["Annika, Bontos",null,null,"Bureau","Annie","Annie, Bureau"]
["Anny, Lepage",null,null,"Bontos","Annika","Annika, Bontos"]
["Anthony, Blackburn-Tremblay",null,null,"Lepage","Anny","Anny, Lepage"]
["Caroline, Beaumier",null,null,"Blackburn-Tremblay","Anthony","Anthony, Blackburn-Tremblay"]
["Catherine, Racicot",null,null,"Beaumier","Caroline","Caroline, Beaumier"]
["Catherine, Rochon",null,null,"Racicot","Catherine","Catherine, Racicot"]
["Cathy, Hamel",null,null,"Rochon","Catherine","Catherine, Rochon"]
["Chantal, Jalbert",null,null,"Hamel","Cathy","Cathy, Hamel"]
["Chantal, Ruël",null,null,"Jalbert","Chantal","Chantal, Jalbert"]
["Chantal, Vaillancourt",null,null,"Ruël","Chantal","Chantal, Ruël"]
["Christine, Desrosiers",null,null,"Vaillancourt","Chantal","Chantal, Vaillancourt"]
["Claire, Bissonnette",null,null,"Desrosiers","Christine","Christine, Desrosiers"]
["Daniel, Shedleur",null,null,"Bissonnette","Claire","Claire, Bissonnette"]
["Danielle, Léonard",null,null,"Shedleur","Daniel","Daniel, Shedleur"]
["Daphné, Guerard-Pergallino",null,null,"Léonard","Danielle","Danielle, Léonard"]
{"$rows_left_out":75}